Reaction Details
Target72 kDa type IV collagenase
LigandBDBM50033805
Substrate/Competitorn/a
Meas. Tech.ChEMBL_1435761 (CHEMBL3388953)
IC50 1800±n/a nM
Citation Durham, TBKlimkowski, VJRito, CJMarimuthu, JToth, JLLiu, CDurbin, JDStout, SLAdams, LSwearingen, CLin, CChambers, MGThirunavukkarasu, KWiley, MR Identification of potent and selective hydantoin inhibitors of aggrecanase-1 and aggrecanase-2 that are efficacious in both chemical and surgical models of osteoarthritis. J Med Chem57:10476-85 (2014) 
 
72 kDa type IV collagenase
Name:72 kDa type IV collagenase
Type:Enzyme
Mol. Mass.:73870.36
Organism:Homo sapiens (Human)
Description: P08253
Residue:660
BDBM50033805
NameBDBM50033805
Synonyms:CHEMBL3358155
TypeSmall organic molecule
Emp. Form.C16H11ClN4O4S
Mol. Mass.390.801
SMILESClc1ccc2oc(cc2c1)C(=O)NC[C@]1(NC(=O)NC1=O)c1nccs1