Reaction Details
Target72 kDa type IV collagenase
LigandBDBM50033806
Substrate/Competitorn/a
Meas. Tech.ChEMBL_1435761 (CHEMBL3388953)
IC50 7500±n/a nM
Citation Durham, TBKlimkowski, VJRito, CJMarimuthu, JToth, JLLiu, CDurbin, JDStout, SLAdams, LSwearingen, CLin, CChambers, MGThirunavukkarasu, KWiley, MR Identification of potent and selective hydantoin inhibitors of aggrecanase-1 and aggrecanase-2 that are efficacious in both chemical and surgical models of osteoarthritis. J Med Chem57:10476-85 (2014) 
 
72 kDa type IV collagenase
Name:72 kDa type IV collagenase
Type:Enzyme
Mol. Mass.:73870.36
Organism:Homo sapiens (Human)
Description: P08253
Residue:660
BDBM50033806
NameBDBM50033806
Synonyms:CHEMBL3358156
TypeSmall organic molecule
Emp. Form.C17H14ClN5O4
Mol. Mass.387.777
SMILESCn1ccnc1[C@]1(CNC(=O)c2cc3cc(Cl)ccc3o2)NC(=O)NC1=O