Reaction Details
TargetCollagenase 3
LigandBDBM50033809
Substrate/Competitorn/a
Meas. Tech.ChEMBL_1435763 (CHEMBL3388955)
IC50 7000±n/a nM
Citation Durham, TBKlimkowski, VJRito, CJMarimuthu, JToth, JLLiu, CDurbin, JDStout, SLAdams, LSwearingen, CLin, CChambers, MGThirunavukkarasu, KWiley, MR Identification of potent and selective hydantoin inhibitors of aggrecanase-1 and aggrecanase-2 that are efficacious in both chemical and surgical models of osteoarthritis. J Med Chem57:10476-85 (2014) 
 
Collagenase 3
Name:Collagenase 3
Type:Enzyme
Mol. Mass.:53808.06
Organism:Homo sapiens (Human)
Description:P45452
Residue:471
BDBM50033809
NameBDBM50033809
Synonyms:CHEMBL3358151
TypeSmall organic molecule
Emp. Form.C13H14ClN3O4
Mol. Mass.311.721
SMILESC[C@]1(CNC(=O)COc2ccc(Cl)cc2)NC(=O)NC1=O