Reaction Details
TargetReverse transcriptase
LigandBDBM50033878
Substrate/Competitorn/a
Meas. Tech.ChEMBL_1435796 (CHEMBL3389551)
IC50 3.0±n/a nM
Citation Famiglini, VLa Regina, GColuccia, APelliccia, SBrancale, AMaga, GCrespan, EBadia, RRiveira-Muñoz, EEsté, JAFerretti, RCirilli, RZamperini, CBotta, MSchols, DLimongelli, VAgostino, BNovellino, ESilvestri, R Indolylarylsulfones carrying a heterocyclic tail as very potent and broad spectrum HIV-1 non-nucleoside reverse transcriptase inhibitors. J Med Chem57:9945-57 (2014) 
 
Reverse transcriptase
Name:Reverse transcriptase
Synonyms:n/a
Type:Protein
Mol. Mass.:29598.37
Organism:Human immunodeficiency virus 1
Description:Q9WKE8
Residue:254
BDBM50033878
NameBDBM50033878
Synonyms:CHEMBL3358170
TypeSmall organic molecule
Emp. Form.C22H19ClN2O4S
Mol. Mass.442.915
SMILESCc1cc(C)cc(c1)S(=O)(=O)c1c([nH]c2ccc(Cl)cc12)C(=O)NCc1ccco1