Reaction Details
TargetPA-I galactophilic lectin
LigandBDBM50243888
Substrate/Competitorn/a
Meas. Tech.ChEMBL_1436493 (CHEMBL3381675)
Kd 70000±n/a nM
Citation Boukerb, AMRousset, AGalanos, NMéar, JBThépaut, MGrandjean, TGillon, ECecioni, SAbderrahmen, CFaure, KRedelberger, DKipnis, EDessein, RHavet, SDarblade, BMatthews, SEde Bentzmann, SGuéry, BCournoyer, BImberty, AVidal, S Antiadhesive properties of glycoclusters against Pseudomonas aeruginosa lung infection. J Med Chem57:10275-89 (2014) 
 
PA-I galactophilic lectin
Name:PA-I galactophilic lectin
Type:PROTEIN
Mol. Mass.:12891.24
Organism:Pseudomonas aeruginosa (strain ATCC 15692 / PAO1 / 1C / PRS 101 / LMG12228)
Description:ChEMBL_109520
Residue:122
BDBM50243888
NameBDBM50243888
Synonyms:CHEMBL442951 methyl beta-D-galactoside
TypeSmall organic molecule
Emp. Form.C7H14O6
Mol. Mass.194.1825
SMILESCO[C@@H]1O[C@H](CO)[C@H](O)[C@H](O)[C@H]1O