Reaction Details
TargetAcetyl-CoA carboxylase 1
LigandBDBM50034371
Substrate/Competitorn/a
Meas. Tech.ChEMBL_1438677 (CHEMBL3387921)
IC50 27±n/a nM
Citation Griffith, DAKung, DWEsler, WPAmor, PABagley, SWBeysen, CCarvajal-Gonzalez, SDoran, SDLimberakis, CMathiowetz, AMMcPherson, KPrice, DARavussin, ESonnenberg, GESouthers, JASweet, LJTurner, SMVajdos, FF Decreasing the rate of metabolic ketone reduction in the discovery of a clinical acetyl-CoA carboxylase inhibitor for the treatment of diabetes. J Med Chem57:10512-26 (2014) 
 
Acetyl-CoA carboxylase 1
Name:Acetyl-CoA carboxylase 1
Type:Protein
Mol. Mass.:265543.22
Organism:Homo sapiens (Human)
Description:Q13085
Residue:2346
BDBM50034371
NameBDBM50034371
Synonyms:CHEMBL3359265
TypeSmall organic molecule
Emp. Form.C23H27N5O2
Mol. Mass.405.4928
SMILESCC(C)n1ncc2CC3(CCN(CC3)C(=O)c3ccc4nc(C)[nH]c4c3)CC(=O)c12