Reaction Details
TargetAcetyl-CoA carboxylase 2
LigandBDBM50034499
Substrate/Competitorn/a
Meas. Tech.ChEMBL_1437940 (CHEMBL3385490)
IC50 78.0±n/a nM
Citation Griffith, DAKung, DWEsler, WPAmor, PABagley, SWBeysen, CCarvajal-Gonzalez, SDoran, SDLimberakis, CMathiowetz, AMMcPherson, KPrice, DARavussin, ESonnenberg, GESouthers, JASweet, LJTurner, SMVajdos, FF Decreasing the rate of metabolic ketone reduction in the discovery of a clinical acetyl-CoA carboxylase inhibitor for the treatment of diabetes. J Med Chem57:10512-26 (2014) 
 
Acetyl-CoA carboxylase 2
Name:Acetyl-CoA carboxylase 2
Type:Protein
Mol. Mass.:276535.21
Organism:Homo sapiens (Human)
Description:O00763
Residue:2458
BDBM50034499
NameBDBM50034499
Synonyms:CHEMBL3359259
TypeSmall organic molecule
Emp. Form.C23H27N5O3
Mol. Mass.421.4922
SMILESCC1C(=O)c2nn(cc2OC11CCN(CC1)C(=O)c1ccc2[nH]ncc2c1)C(C)(C)C