Reaction Details
TargetCytochrome P450 2D6
LigandBDBM50034554
Substrate/Competitorn/a
Meas. Tech.ChEMBL_1439477 (CHEMBL3381254)
IC50>50000±n/a nM
Citation Skidmore, JHeer, JJohnson, CNNorton, DRedshaw, SSweeting, JHurst, DCridland, AVesey, DWall, IAhmed, MRivers, DMyatt, JGiblin, GPhilpott, KKumar, UStevens, ABit, RAHaynes, ATaylor, SWatson, RWitherington, JDemont, EHeightman, TD Optimization of sphingosine-1-phosphate-1 receptor agonists: effects of acidic, basic, and zwitterionic chemotypes on pharmacokinetic and pharmacodynamic profiles. J Med Chem57:10424-42 (2014) 
 
Cytochrome P450 2D6
Name:Cytochrome P450 2D6
Type:Protein
Mol. Mass.:55774.82
Organism:Homo sapiens (Human)
Description:P10635
Residue:497
BDBM50034554
NameBDBM50034554
Synonyms:CHEMBL3359854
TypeSmall organic molecule
Emp. Form.C23H25ClN4O5
Mol. Mass.472.921
SMILESCC(C)Oc1ncc(cc1Cl)-c1nc(no1)-c1cccc2C(CCCC(O)=O)NCCOc12