Reaction Details
TargetCytochrome P450 1A2
LigandBDBM50034557
Substrate/Competitorn/a
Meas. Tech.ChEMBL_1439474 (CHEMBL3381251)
IC50>50000±n/a nM
Citation Skidmore, JHeer, JJohnson, CNNorton, DRedshaw, SSweeting, JHurst, DCridland, AVesey, DWall, IAhmed, MRivers, DMyatt, JGiblin, GPhilpott, KKumar, UStevens, ABit, RAHaynes, ATaylor, SWatson, RWitherington, JDemont, EHeightman, TD Optimization of sphingosine-1-phosphate-1 receptor agonists: effects of acidic, basic, and zwitterionic chemotypes on pharmacokinetic and pharmacodynamic profiles. J Med Chem57:10424-42 (2014) 
 
Cytochrome P450 1A2
Name:Cytochrome P450 1A2
Type:Enzyme
Mol. Mass.:58423.38
Organism:Homo sapiens (Human)
Description:P05177
Residue:516
BDBM50034557
NameBDBM50034557
Synonyms:CHEMBL3360360
TypeSmall organic molecule
Emp. Form.C21H18ClN4NaO4
Mol. Mass.448.835
SMILES[Na+].CC(C)Oc1ccc(cc1Cl)-c1nc(no1)-c1cccc2n(CCC([O-])=O)ncc12