Reaction Details
TargetSphingosine 1-phosphate receptor 3
LigandBDBM50034613
Substrate/Competitorn/a
Meas. Tech.ChEMBL_1439470 (CHEMBL3381247)
EC50 1995±n/a nM
Citation Skidmore, JHeer, JJohnson, CNNorton, DRedshaw, SSweeting, JHurst, DCridland, AVesey, DWall, IAhmed, MRivers, DMyatt, JGiblin, GPhilpott, KKumar, UStevens, ABit, RAHaynes, ATaylor, SWatson, RWitherington, JDemont, EHeightman, TD Optimization of sphingosine-1-phosphate-1 receptor agonists: effects of acidic, basic, and zwitterionic chemotypes on pharmacokinetic and pharmacodynamic profiles. J Med Chem57:10424-42 (2014) 
 
Sphingosine 1-phosphate receptor 3
Name:Sphingosine 1-phosphate receptor 3
Type:G Protein-Coupled Receptor (GPCR)
Mol. Mass.:42278.13
Organism:Homo sapiens (Human)
Description:Q99500
Residue:378
BDBM50034613
NameBDBM50034613
Synonyms:CHEMBL3360377
TypeSmall organic molecule
Emp. Form.C23H24ClN3O4
Mol. Mass.441.907
SMILESCC(C)Oc1ccc(cc1Cl)-c1nc(no1)-c1cccc2CN(CCCC(O)=O)Cc12