Reaction Details
TargetSphingosine 1-phosphate receptor 1
LigandBDBM50034554
Substrate/Competitorn/a
Meas. Tech.ChEMBL_1439469 (CHEMBL3381246)
EC50 50.1±n/a nM
Citation Skidmore, JHeer, JJohnson, CNNorton, DRedshaw, SSweeting, JHurst, DCridland, AVesey, DWall, IAhmed, MRivers, DMyatt, JGiblin, GPhilpott, KKumar, UStevens, ABit, RAHaynes, ATaylor, SWatson, RWitherington, JDemont, EHeightman, TD Optimization of sphingosine-1-phosphate-1 receptor agonists: effects of acidic, basic, and zwitterionic chemotypes on pharmacokinetic and pharmacodynamic profiles. J Med Chem57:10424-42 (2014) 
 
Sphingosine 1-phosphate receptor 1
Name:Sphingosine 1-phosphate receptor 1
Type:Enzyme
Mol. Mass.:42836.02
Organism:Homo sapiens (Human)
Description:P21453
Residue:382
BDBM50034554
NameBDBM50034554
Synonyms:CHEMBL3359854
TypeSmall organic molecule
Emp. Form.C23H25ClN4O5
Mol. Mass.472.921
SMILESCC(C)Oc1ncc(cc1Cl)-c1nc(no1)-c1cccc2C(CCCC(O)=O)NCCOc12