Reaction Details
TargetSphingosine 1-phosphate receptor 1
LigandBDBM50034614
Substrate/Competitorn/a
Meas. Tech.ChEMBL_1439469 (CHEMBL3381246)
EC50 316±n/a nM
Citation Skidmore, JHeer, JJohnson, CNNorton, DRedshaw, SSweeting, JHurst, DCridland, AVesey, DWall, IAhmed, MRivers, DMyatt, JGiblin, GPhilpott, KKumar, UStevens, ABit, RAHaynes, ATaylor, SWatson, RWitherington, JDemont, EHeightman, TD Optimization of sphingosine-1-phosphate-1 receptor agonists: effects of acidic, basic, and zwitterionic chemotypes on pharmacokinetic and pharmacodynamic profiles. J Med Chem57:10424-42 (2014) 
 
Sphingosine 1-phosphate receptor 1
Name:Sphingosine 1-phosphate receptor 1
Type:Enzyme
Mol. Mass.:42836.02
Organism:Homo sapiens (Human)
Description:P21453
Residue:382
BDBM50034614
NameBDBM50034614
Synonyms:CHEMBL3360376
TypeSmall organic molecule
Emp. Form.C22H22ClN3O4
Mol. Mass.427.881
SMILESCC(C)Oc1ccc(cc1Cl)-c1nc(no1)-c1cccc2CN(CCC(O)=O)Cc12