Reaction Details
TargetHigh affinity cGMP-specific 3',5'-cyclic phosphodiesterase 9A
LigandBDBM50034642
Substrate/Competitorn/a
Meas. Tech.ChEMBL_1440216 (CHEMBL3383761)
IC50 3.0±n/a nM
Citation Shao, YXHuang, MCui, WFeng, LJWu, YCai, YLi, ZZhu, XLiu, PWan, YKe, HLuo, HB Discovery of a phosphodiesterase 9A inhibitor as a potential hypoglycemic agent. J Med Chem57:10304-13 (2014) 
 
High affinity cGMP-specific 3',5'-cyclic phosphodiesterase 9A
Name:High affinity cGMP-specific 3',5'-cyclic phosphodiesterase 9A
Type:Protein
Mol. Mass.:68488.40
Organism:Homo sapiens (Human)
Description:O76083
Residue:593
BDBM50034642
NameBDBM50034642
Synonyms:CHEMBL3360416
TypeSmall organic molecule
Emp. Form.C20H24N6O3
Mol. Mass.396.443
SMILESCOc1ccc(NC(=O)[C@H](C)Nc2nc3n(ncc3c(=O)[nH]2)C2CCCC2)cc1