Reaction Details
Target5-hydroxytryptamine receptor 1A
LigandBDBM50034792
Substrate/Competitorn/a
Meas. Tech.ChEMBL_1441766 (CHEMBL3378889)
Ki 1.2±n/a nM
Citation Partyka, AChlon-Rzepa, GWasik, AJastrzebska-Wiesek, MBucki, AKolaczkowski, MSatala, GBojarski, AJWesolowska, A Antidepressant- and anxiolytic-like activity of 7-phenylpiperazinylalkyl-1,3-dimethyl-purine-2,6-dione derivatives with diversified 5-HT1A receptor functional profile. Bioorg Med Chem23:212-21 (2014) 
 
5-hydroxytryptamine receptor 1A
Name:5-hydroxytryptamine receptor 1A
Type:G Protein-Coupled Receptor (GPCR)
Mol. Mass.:46445.29
Organism:Rattus norvegicus (rat)
Description:Binding assays were performed using rat hippocampal membranes.
Residue:422
BDBM50034792
NameBDBM50034792
Synonyms:CHEMBL3360995
TypeSmall organic molecule
Emp. Form.C22H31ClN6O3
Mol. Mass.462.973
SMILESCl.COc1ccccc1N1CCN(CCCCn2cnc3n(C)c(=O)n(C)c(=O)c23)CC1