Reaction Details
Target5-hydroxytryptamine receptor 6
LigandBDBM35254
Substrate/Competitorn/a
Meas. Tech.ChEMBL_1441768 (CHEMBL3378891)
Ki 7.0±n/a nM
Citation Partyka, AChlon-Rzepa, GWasik, AJastrzebska-Wiesek, MBucki, AKolaczkowski, MSatala, GBojarski, AJWesolowska, A Antidepressant- and anxiolytic-like activity of 7-phenylpiperazinylalkyl-1,3-dimethyl-purine-2,6-dione derivatives with diversified 5-HT1A receptor functional profile. Bioorg Med Chem23:212-21 (2014) 
 
5-hydroxytryptamine receptor 6
Name:5-hydroxytryptamine receptor 6
Type:G Protein-Coupled Receptor (GPCR)
Mol. Mass.:46968.43
Organism:Homo sapiens (Human)
Description:P50406
Residue:440
BDBM35254
NameBDBM35254
Synonyms:2-methyl-4-(4-methylpiperazin-1-yl)-10H-thieno[2,3-b][1,5]benzodiazepine Olansek Zyprexa | olanzapine
TypeSmall organic molecule
Emp. Form.C17H20N4S
Mol. Mass.312.432
SMILESCN1CCN(CC1)C1=Nc2ccccc2Nc2sc(C)cc12