Reaction Details
TargetCarbonic anhydrase 1
LigandBDBM50035169
Substrate/Competitorn/a
Meas. Tech.ChEMBL_1432722 (CHEMBL3390526)
Ki>10000±n/a nM
Citation Ombouma, JVullo, DSupuran, CTWinum, JY Ferrier sulfamidoglycosylation of glycals catalyzed by nitrosonium tetrafluoroborate: towards new carbonic anhydrase glycoinhibitors. Bioorg Med Chem22:6353-9 (2014) 
 
Carbonic anhydrase 1
Name:Carbonic anhydrase 1
Type:Enzyme
Mol. Mass.:28873.37
Organism:Homo sapiens (Human)
Description:P00915
Residue:261
BDBM50035169
NameBDBM50035169
Synonyms:CHEMBL3343179
TypeSmall organic molecule
Emp. Form.C7H12N2O6S
Mol. Mass.252.245
SMILESCC(=O)O[C@@H]1COC(NS(=O)(=O)NO)C=C1