Reaction Details
TargetCarbonic anhydrase 1
LigandBDBM50035175
Substrate/Competitorn/a
Meas. Tech.ChEMBL_1432722 (CHEMBL3390526)
Ki>10000±n/a nM
Citation Ombouma, JVullo, DSupuran, CTWinum, JY Ferrier sulfamidoglycosylation of glycals catalyzed by nitrosonium tetrafluoroborate: towards new carbonic anhydrase glycoinhibitors. Bioorg Med Chem22:6353-9 (2014) 
 
Carbonic anhydrase 1
Name:Carbonic anhydrase 1
Type:Enzyme
Mol. Mass.:28873.37
Organism:Homo sapiens (Human)
Description:P00915
Residue:261
BDBM50035175
NameBDBM50035175
Synonyms:CHEMBL3343325
TypeSmall organic molecule
Emp. Form.C5H10N2O5S
Mol. Mass.210.208
SMILESONS(=O)(=O)NC1OC[C@H](O)C=C1