Reaction Details
TargetCarbonic anhydrase 2
LigandBDBM50035170
Substrate/Competitorn/a
Meas. Tech.ChEMBL_1432723 (CHEMBL3390527)
Ki>10000±n/a nM
Citation Ombouma, JVullo, DSupuran, CTWinum, JY Ferrier sulfamidoglycosylation of glycals catalyzed by nitrosonium tetrafluoroborate: towards new carbonic anhydrase glycoinhibitors. Bioorg Med Chem22:6353-9 (2014) 
 
Carbonic anhydrase 2
Name:Carbonic anhydrase 2
Type:Enzyme
Mol. Mass.:29250.71
Organism:Homo sapiens (Human)
Description:P00918
Residue:260
BDBM50035170
NameBDBM50035170
Synonyms:CHEMBL3343180
TypeSmall organic molecule
Emp. Form.C7H12N2O6S
Mol. Mass.252.245
SMILESCC(=O)O[C@H]1COC(NS(=O)(=O)NO)C=C1