Reaction Details
TargetCarbonic anhydrase 2
LigandBDBM50035172
Substrate/Competitorn/a
Meas. Tech.ChEMBL_1432723 (CHEMBL3390527)
Ki 91±n/a nM
Citation Ombouma, JVullo, DSupuran, CTWinum, JY Ferrier sulfamidoglycosylation of glycals catalyzed by nitrosonium tetrafluoroborate: towards new carbonic anhydrase glycoinhibitors. Bioorg Med Chem22:6353-9 (2014) 
 
Carbonic anhydrase 2
Name:Carbonic anhydrase 2
Type:Enzyme
Mol. Mass.:29250.71
Organism:Homo sapiens (Human)
Description:P00918
Residue:260
BDBM50035172
NameBDBM50035172
Synonyms:CHEMBL3343322
TypeSmall organic molecule
Emp. Form.C6H12N2O6S
Mol. Mass.240.234
SMILESOC[C@H]1OC(NS(=O)(=O)NO)C=C[C@@H]1O