Reaction Details
TargetCarbonic anhydrase 12
LigandBDBM50035170
Substrate/Competitorn/a
Meas. Tech.ChEMBL_1432725 (CHEMBL3390529)
Ki 81±n/a nM
Citation Ombouma, JVullo, DSupuran, CTWinum, JY Ferrier sulfamidoglycosylation of glycals catalyzed by nitrosonium tetrafluoroborate: towards new carbonic anhydrase glycoinhibitors. Bioorg Med Chem22:6353-9 (2014) 
 
Carbonic anhydrase 12
Name:Carbonic anhydrase 12
Type:Enzyme
Mol. Mass.:39456.00
Organism:Homo sapiens (Human)
Description:Catalytic domain of human cloned isozyme was used in the assay
Residue:354
BDBM50035170
NameBDBM50035170
Synonyms:CHEMBL3343180
TypeSmall organic molecule
Emp. Form.C7H12N2O6S
Mol. Mass.252.245
SMILESCC(=O)O[C@H]1COC(NS(=O)(=O)NO)C=C1