Reaction Details
TargetHepatocyte growth factor receptor
LigandBDBM50399540
Substrate/Competitorn/a
Meas. Tech.ChEMBL_1432749 (CHEMBL3381417)
IC50 1.8±n/a nM
Citation Zhou, SLiao, HLiu, MFeng, GFu, BLi, RCheng, MZhao, YGong, P Discovery andw biological evaluation of novel 6,7-disubstituted-4-(2-fluorophenoxy)quinoline derivatives possessing 1,2,3-triazole-4-carboxamide moiety as c-Met kinase inhibitors. Bioorg Med Chem22:6438-52 (2014) 
 
Hepatocyte growth factor receptor
Name:Hepatocyte growth factor receptor
Type:Protein
Mol. Mass.:155559.73
Organism:Homo sapiens (Human)
Description:P08581
Residue:1390
BDBM50399540
NameBDBM50399540
Synonyms:FORETINIB US10882853, Compound For-Oxide
TypeSmall organic molecule
Emp. Form.C34H34F2N4O6
Mol. Mass.632.6538
SMILESCOc1cc2c(Oc3ccc(NC(=O)C4(CC4)C(=O)Nc4ccc(F)cc4)cc3F)ccnc2cc1OCCCN1CCOCC1