Reaction Details
TargetReceptor-type tyrosine-protein kinase FLT3
LigandBDBM50035354
Substrate/Competitorn/a
Meas. Tech.ChEMBL_1432757 (CHEMBL3381425)
IC50 8.8±n/a nM
Citation Zhou, SLiao, HLiu, MFeng, GFu, BLi, RCheng, MZhao, YGong, P Discovery andw biological evaluation of novel 6,7-disubstituted-4-(2-fluorophenoxy)quinoline derivatives possessing 1,2,3-triazole-4-carboxamide moiety as c-Met kinase inhibitors. Bioorg Med Chem22:6438-52 (2014) 
 
Receptor-type tyrosine-protein kinase FLT3
Name:Receptor-type tyrosine-protein kinase FLT3
Type:Enzyme
Mol. Mass.:112888.62
Organism:Homo sapiens (Human)
Description:P36888
Residue:993
BDBM50035354
NameBDBM50035354
Synonyms:CHEMBL3343366
TypeSmall organic molecule
Emp. Form.C33H29F5N6O4
Mol. Mass.668.6132
SMILESCOc1cc2c(Oc3ccc(NC(=O)c4nnn(c4C(F)(F)F)-c4ccc(F)cc4)cc3F)ccnc2cc1OCCCN1CCCC1