Reaction Details
TargetPlatelet-derived growth factor receptor beta
LigandBDBM50035526
Substrate/Competitorn/a
Meas. Tech.ChEMBL_1431958 (CHEMBL3387489)
IC50 7000±n/a nM
Citation Liu, ZWu, SWang, YLi, RWang, JWang, LZhao, YGong, P Design, synthesis and biological evaluation of novel thieno[3,2-d]pyrimidine derivatives possessing diaryl semicarbazone scaffolds as potent antitumor agents. Eur J Med Chem87:782-93 (2014) 
 
Platelet-derived growth factor receptor beta
Name:Platelet-derived growth factor receptor beta
Type:Enzyme
Mol. Mass.:123922.25
Organism:Homo sapiens (Human)
Description:P09619
Residue:1106
BDBM50035526
NameBDBM50035526
Synonyms:CHEMBL3343621
TypeSmall organic molecule
Emp. Form.C26H26N6O3S
Mol. Mass.502.588
SMILESCc1cc(\C=N\NC(=O)Nc2ccc(cc2)-c2nc(N3CCOCC3)c3sccc3n2)cc(C)c1O