Reaction Details
TargetCytochrome P450 2E1
LigandBDBM50032693
Substrate/Competitorn/a
Meas. Tech.ChEMBL_1433628 (CHEMBL3385207)
IC50>20000±n/a nM
Citation Hadida, SVan Goor, FZhou, JArumugam, VMcCartney, JHazlewood, ADecker, CNegulescu, PGrootenhuis, PD Discovery of N-(2,4-di-tert-butyl-5-hydroxyphenyl)-4-oxo-1,4-dihydroquinoline-3-carboxamide (VX-770, ivacaftor), a potent and orally bioavailable CFTR potentiator. J Med Chem57:9776-95 (2014) 
 
Cytochrome P450 2E1
Name:Cytochrome P450 2E1
Type:Enzyme
Mol. Mass.:56860.34
Organism:Homo sapiens (Human)
Description:P05181
Residue:493
BDBM50032693
NameBDBM50032693
Synonyms:CHEBI:66901 Kalydeco | VX-770
TypeSmall organic molecule
Emp. Form.C24H28N2O3
Mol. Mass.392.4907
SMILESCC(C)(C)c1cc(c(NC(=O)c2c[nH]c3ccccc3c2=O)cc1O)C(C)(C)C