Reaction Details
TargetSerine/threonine-protein kinase PknB
LigandBDBM50035663
Substrate/Competitorn/a
Meas. Tech.ChEMBL_1434383 (CHEMBL3387070)
Ki 7010±n/a nM
Citation Naqvi, AMalasoni, RSrivastava, APandey, RRDwivedi, AK Design, synthesis and molecular docking of substituted 3-hydrazinyl-3-oxo-propanamides as anti-tubercular agents. Bioorg Med Chem Lett24:5181-4 (2014) 
 
Serine/threonine-protein kinase PknB
Name:Serine/threonine-protein kinase PknB
Type:PROTEIN
Mol. Mass.:66497.93
Organism:Mycobacterium tuberculosis
Description:ChEMBL_774233
Residue:626
BDBM50035663
NameBDBM50035663
Synonyms:CHEMBL3338463
TypeSmall organic molecule
Emp. Form.C11H15N3O4
Mol. Mass.253.2545
SMILESCOc1ccc(OC)c(NC(=O)CC(=O)NN)c1