Reaction Details
TargetCarbonic anhydrase 1
LigandBDBM45791
Substrate/Competitorn/a
Meas. Tech.ChEMBL_1434385 (CHEMBL3387072)
Ki 30±n/a nM
Citation Abdel-Aziz, AAEl-Azab, ASCeruso, MSupuran, CT Carbonic anhydrase inhibitory activity of sulfonamides and carboxylic acids incorporating cyclic imide scaffolds. Bioorg Med Chem Lett24:5185-9 (2014) 
 
Carbonic anhydrase 1
Name:Carbonic anhydrase 1
Type:Enzyme
Mol. Mass.:28873.37
Organism:Homo sapiens (Human)
Description:P00915
Residue:261
BDBM45791
NameBDBM45791
Synonyms:4-(1,3-dioxo-2-isoindolyl)benzoic acid 4-[1,3-bis(oxidanylidene)isoindol-2-yl]benzoic acid MLS-0091937.0001 | cid_246499
TypeSmall organic molecule
Emp. Form.C15H9NO4
Mol. Mass.267.2363
SMILESOC(=O)c1ccc(cc1)N1C(=O)c2ccccc2C1=O