Reaction Details
TargetCarbonic anhydrase 1
LigandBDBM50035672
Substrate/Competitorn/a
Meas. Tech.ChEMBL_1434385 (CHEMBL3387072)
Ki 27±n/a nM
Citation Abdel-Aziz, AAEl-Azab, ASCeruso, MSupuran, CT Carbonic anhydrase inhibitory activity of sulfonamides and carboxylic acids incorporating cyclic imide scaffolds. Bioorg Med Chem Lett24:5185-9 (2014) 
 
Carbonic anhydrase 1
Name:Carbonic anhydrase 1
Type:Enzyme
Mol. Mass.:28873.37
Organism:Homo sapiens (Human)
Description:P00915
Residue:261
BDBM50035672
NameBDBM50035672
Synonyms:CHEMBL2377795
TypeSmall organic molecule
Emp. Form.C15H7Cl2NO4
Mol. Mass.336.126
SMILESOC(=O)c1ccc(cc1)N1C(=O)c2cc(Cl)c(Cl)cc2C1=O