Reaction Details
TargetCarbonic anhydrase 2
LigandBDBM50035683
Substrate/Competitorn/a
Meas. Tech.ChEMBL_1434386 (CHEMBL3387073)
Ki 190±n/a nM
Citation Abdel-Aziz, AAEl-Azab, ASCeruso, MSupuran, CT Carbonic anhydrase inhibitory activity of sulfonamides and carboxylic acids incorporating cyclic imide scaffolds. Bioorg Med Chem Lett24:5185-9 (2014) 
 
Carbonic anhydrase 2
Name:Carbonic anhydrase 2
Type:Enzyme
Mol. Mass.:29250.71
Organism:Homo sapiens (Human)
Description:P00918
Residue:260
BDBM50035683
NameBDBM50035683
Synonyms:CHEMBL2377785
TypeSmall organic molecule
Emp. Form.C15H13NO4
Mol. Mass.271.268
SMILES[H][C@@]12CC=CC[C@]1([H])C(=O)N(C2=O)c1ccc(cc1)C(O)=O