Reaction Details
TargetCarbonic anhydrase 2
LigandBDBM50035694
Substrate/Competitorn/a
Meas. Tech.ChEMBL_1434386 (CHEMBL3387073)
Ki 11±n/a nM
Citation Abdel-Aziz, AAEl-Azab, ASCeruso, MSupuran, CT Carbonic anhydrase inhibitory activity of sulfonamides and carboxylic acids incorporating cyclic imide scaffolds. Bioorg Med Chem Lett24:5185-9 (2014) 
 
Carbonic anhydrase 2
Name:Carbonic anhydrase 2
Type:Enzyme
Mol. Mass.:29250.71
Organism:Homo sapiens (Human)
Description:P00918
Residue:260
BDBM50035694
NameBDBM50035694
Synonyms:CHEMBL2377793
TypeSmall organic molecule
Emp. Form.C15H10Cl2N2O4S
Mol. Mass.385.222
SMILESNS(=O)(=O)c1ccc(CN2C(=O)c3cc(Cl)c(Cl)cc3C2=O)cc1