Reaction Details
TargetCarbonic anhydrase 2
LigandBDBM50035678
Substrate/Competitorn/a
Meas. Tech.ChEMBL_1434386 (CHEMBL3387073)
Ki>1000±n/a nM
Citation Abdel-Aziz, AAEl-Azab, ASCeruso, MSupuran, CT Carbonic anhydrase inhibitory activity of sulfonamides and carboxylic acids incorporating cyclic imide scaffolds. Bioorg Med Chem Lett24:5185-9 (2014) 
 
Carbonic anhydrase 2
Name:Carbonic anhydrase 2
Type:Enzyme
Mol. Mass.:29250.71
Organism:Homo sapiens (Human)
Description:P00918
Residue:260
BDBM50035678
NameBDBM50035678
Synonyms:CHEMBL2377774
TypeSmall organic molecule
Emp. Form.C15H8N2O6
Mol. Mass.312.2338
SMILESOC(=O)c1ccc(cc1)N1C(=O)c2ccc(cc2C1=O)[N+]([O-])=O