Reaction Details
TargetCarbonic anhydrase 2
LigandBDBM50035697
Substrate/Competitorn/a
Meas. Tech.ChEMBL_1434386 (CHEMBL3387073)
Ki 5.3±n/a nM
Citation Abdel-Aziz, AAEl-Azab, ASCeruso, MSupuran, CT Carbonic anhydrase inhibitory activity of sulfonamides and carboxylic acids incorporating cyclic imide scaffolds. Bioorg Med Chem Lett24:5185-9 (2014) 
 
Carbonic anhydrase 2
Name:Carbonic anhydrase 2
Type:Enzyme
Mol. Mass.:29250.71
Organism:Homo sapiens (Human)
Description:P00918
Residue:260
BDBM50035697
NameBDBM50035697
Synonyms:CHEMBL2377778
TypeSmall organic molecule
Emp. Form.C19H14N2O4S
Mol. Mass.366.39
SMILESNS(=O)(=O)c1ccc(CN2C(=O)c3cccc4cccc(C2=O)c34)cc1