Reaction Details
TargetCarbonic anhydrase 9
LigandBDBM50035684
Substrate/Competitorn/a
Meas. Tech.ChEMBL_1434387 (CHEMBL3387074)
Ki 4.4±n/a nM
Citation Abdel-Aziz, AAEl-Azab, ASCeruso, MSupuran, CT Carbonic anhydrase inhibitory activity of sulfonamides and carboxylic acids incorporating cyclic imide scaffolds. Bioorg Med Chem Lett24:5185-9 (2014) 
 
Carbonic anhydrase 9
Name:Carbonic anhydrase 9
Type:Enzyme
Mol. Mass.:49669.03
Organism:Homo sapiens (Human)
Description:Catalytic domain of human cloned isozyme was used in the assay
Residue:459
BDBM50035684
NameBDBM50035684
Synonyms:CHEMBL2377784
TypeSmall organic molecule
Emp. Form.C14H14N2O4S
Mol. Mass.306.337
SMILES[H][C@@]12CC=CC[C@]1([H])C(=O)N(C2=O)c1ccc(cc1)S(N)(=O)=O