Reaction Details
TargetCarbonic anhydrase 9
LigandBDBM50035673
Substrate/Competitorn/a
Meas. Tech.ChEMBL_1434387 (CHEMBL3387074)
Ki 3.1±n/a nM
Citation Abdel-Aziz, AAEl-Azab, ASCeruso, MSupuran, CT Carbonic anhydrase inhibitory activity of sulfonamides and carboxylic acids incorporating cyclic imide scaffolds. Bioorg Med Chem Lett24:5185-9 (2014) 
 
Carbonic anhydrase 9
Name:Carbonic anhydrase 9
Type:Enzyme
Mol. Mass.:49669.03
Organism:Homo sapiens (Human)
Description:Catalytic domain of human cloned isozyme was used in the assay
Residue:459
BDBM50035673
NameBDBM50035673
Synonyms:CHEMBL2377796
TypeSmall organic molecule
Emp. Form.C15H8Cl4N2O4S
Mol. Mass.454.112
SMILESNS(=O)(=O)c1ccc(CN2C(=O)c3c(C2=O)c(Cl)c(Cl)c(Cl)c3Cl)cc1