Reaction Details
TargetCarbonic anhydrase 9
LigandBDBM50035675
Substrate/Competitorn/a
Meas. Tech.ChEMBL_1434387 (CHEMBL3387074)
Ki 4.4±n/a nM
Citation Abdel-Aziz, AAEl-Azab, ASCeruso, MSupuran, CT Carbonic anhydrase inhibitory activity of sulfonamides and carboxylic acids incorporating cyclic imide scaffolds. Bioorg Med Chem Lett24:5185-9 (2014) 
 
Carbonic anhydrase 9
Name:Carbonic anhydrase 9
Type:Enzyme
Mol. Mass.:49669.03
Organism:Homo sapiens (Human)
Description:Catalytic domain of human cloned isozyme was used in the assay
Residue:459
BDBM50035675
NameBDBM50035675
Synonyms:CHEMBL2377771
TypeSmall organic molecule
Emp. Form.C15H5Cl4NO4
Mol. Mass.405.017
SMILESOC(=O)c1ccc(cc1)N1C(=O)c2c(C1=O)c(Cl)c(Cl)c(Cl)c2Cl