Reaction Details
TargetCarbonic anhydrase 9
LigandBDBM50035676
Substrate/Competitorn/a
Meas. Tech.ChEMBL_1434387 (CHEMBL3387074)
Ki 8837±n/a nM
Citation Abdel-Aziz, AAEl-Azab, ASCeruso, MSupuran, CT Carbonic anhydrase inhibitory activity of sulfonamides and carboxylic acids incorporating cyclic imide scaffolds. Bioorg Med Chem Lett24:5185-9 (2014) 
 
Carbonic anhydrase 9
Name:Carbonic anhydrase 9
Type:Enzyme
Mol. Mass.:49669.03
Organism:Homo sapiens (Human)
Description:Catalytic domain of human cloned isozyme was used in the assay
Residue:459
BDBM50035676
NameBDBM50035676
Synonyms:CHEMBL2377772
TypeSmall organic molecule
Emp. Form.C15H11N3O6S
Mol. Mass.361.329
SMILESNS(=O)(=O)c1ccc(CN2C(=O)c3ccc(cc3C2=O)[N+]([O-])=O)cc1