Reaction Details
TargetCarbonic anhydrase 12
LigandBDBM152638
Substrate/Competitorn/a
Meas. Tech.ChEMBL_1434388 (CHEMBL3387075)
Ki 0.530000±n/a nM
Citation Abdel-Aziz, AAEl-Azab, ASCeruso, MSupuran, CT Carbonic anhydrase inhibitory activity of sulfonamides and carboxylic acids incorporating cyclic imide scaffolds. Bioorg Med Chem Lett24:5185-9 (2014) 
 
Carbonic anhydrase 12
Name:Carbonic anhydrase 12
Type:Enzyme
Mol. Mass.:39456.00
Organism:Homo sapiens (Human)
Description:Catalytic domain of human cloned isozyme was used in the assay
Residue:354
BDBM152638
NameBDBM152638
Synonyms:4-(1,3-Dioxoisoindolin-2-yl)benzenesulphonamide (1) | BDBM50222606
TypeSmall organic molecule
Emp. Form.C14H10N2O4S
Mol. Mass.302.305
SMILESNS(=O)(=O)c1ccc(cc1)N1C(=O)c2ccccc2C1=O