Reaction Details
TargetCarbonic anhydrase 12
LigandBDBM50035690
Substrate/Competitorn/a
Meas. Tech.ChEMBL_1434388 (CHEMBL3387075)
Ki 80±n/a nM
Citation Abdel-Aziz, AAEl-Azab, ASCeruso, MSupuran, CT Carbonic anhydrase inhibitory activity of sulfonamides and carboxylic acids incorporating cyclic imide scaffolds. Bioorg Med Chem Lett24:5185-9 (2014) 
 
Carbonic anhydrase 12
Name:Carbonic anhydrase 12
Type:Enzyme
Mol. Mass.:39456.00
Organism:Homo sapiens (Human)
Description:Catalytic domain of human cloned isozyme was used in the assay
Residue:354
BDBM50035690
NameBDBM50035690
Synonyms:CHEMBL2377789
TypeSmall organic molecule
Emp. Form.C16H11NO4
Mol. Mass.281.2628
SMILESCc1ccc2C(=O)N(C(=O)c2c1)c1ccc(cc1)C(O)=O