Reaction Details
TargetTyrosine-protein kinase JAK3
LigandBDBM50035812
Substrate/Competitorn/a
Meas. Tech.ChEMBL_1441071 (CHEMBL3377593)
IC50 12±n/a nM
Citation Duan, JJLu, ZJiang, BYang, BVDoweyko, LMNirschl, DSHaque, LELin, SBrown, GHynes, JTokarski, JSSack, JSKhan, JLippy, JSZhang, RFPitt, SShen, GPitts, WJCarter, PHBarrish, JCNadler, SGSalter-Cid, LMMcKinnon, MFura, ASchieven, GLWrobleski, ST Discovery of pyrrolo[1,2-b]pyridazine-3-carboxamides as Janus kinase (JAK) inhibitors. Bioorg Med Chem Lett24:5721-6 (2014) 
 
Tyrosine-protein kinase JAK3
Name:Tyrosine-protein kinase JAK3
Type:Protein
Mol. Mass.:125111.08
Organism:Homo sapiens (Human)
Description:P52333
Residue:1124
BDBM50035812
NameBDBM50035812
Synonyms:CHEMBL3359919
TypeSmall organic molecule
Emp. Form.C15H21N5O
Mol. Mass.287.3601
SMILESCC1(C)[C@@H](N)CC[C@H]1Nc1c(cnn2cccc12)C(N)=O