Reaction Details
TargetNon-receptor tyrosine-protein kinase TYK2
LigandBDBM50035842
Substrate/Competitorn/a
Meas. Tech.ChEMBL_1441073 (CHEMBL3377595)
IC50 8.0±n/a nM
Citation Duan, JJLu, ZJiang, BYang, BVDoweyko, LMNirschl, DSHaque, LELin, SBrown, GHynes, JTokarski, JSSack, JSKhan, JLippy, JSZhang, RFPitt, SShen, GPitts, WJCarter, PHBarrish, JCNadler, SGSalter-Cid, LMMcKinnon, MFura, ASchieven, GLWrobleski, ST Discovery of pyrrolo[1,2-b]pyridazine-3-carboxamides as Janus kinase (JAK) inhibitors. Bioorg Med Chem Lett24:5721-6 (2014) 
 
Non-receptor tyrosine-protein kinase TYK2
Name:Non-receptor tyrosine-protein kinase TYK2
Type:Protein
Mol. Mass.:133666.03
Organism:Homo sapiens (Human)
Description:P29597
Residue:1187
BDBM50035842
NameBDBM50035842
Synonyms:CHEMBL3359908
TypeSmall organic molecule
Emp. Form.C15H20N4O
Mol. Mass.272.3455
SMILESCC1(C)CCC[C@H]1Nc1c(cnn2cccc12)C(N)=O