Reaction Details
TargetNon-receptor tyrosine-protein kinase TYK2
LigandBDBM50035849
Substrate/Competitorn/a
Meas. Tech.ChEMBL_1441073 (CHEMBL3377595)
IC50 7.0±n/a nM
Citation Duan, JJLu, ZJiang, BYang, BVDoweyko, LMNirschl, DSHaque, LELin, SBrown, GHynes, JTokarski, JSSack, JSKhan, JLippy, JSZhang, RFPitt, SShen, GPitts, WJCarter, PHBarrish, JCNadler, SGSalter-Cid, LMMcKinnon, MFura, ASchieven, GLWrobleski, ST Discovery of pyrrolo[1,2-b]pyridazine-3-carboxamides as Janus kinase (JAK) inhibitors. Bioorg Med Chem Lett24:5721-6 (2014) 
 
Non-receptor tyrosine-protein kinase TYK2
Name:Non-receptor tyrosine-protein kinase TYK2
Type:Protein
Mol. Mass.:133666.03
Organism:Homo sapiens (Human)
Description:P29597
Residue:1187
BDBM50035849
NameBDBM50035849
Synonyms:CHEMBL3359915
TypeSmall organic molecule
Emp. Form.C16H22N4O2
Mol. Mass.302.3715
SMILESC[C@@]1(O)CC[C@@H](Nc2c(cnn3cccc23)C(N)=O)C1(C)C