Reaction Details
TargetNuclear receptor ROR-gamma
LigandBDBM50035914
Substrate/Competitorn/a
Meas. Tech.ChEMBL_1442780 (CHEMBL3375302)
IC50 8.0±n/a nM
Citation van Niel, MBFauber, BPCartwright, MGaines, SKillen, JCRené, OWard, SIde Leon Boenig, GDeng, YEidenschenk, CEverett, CGancia, EGanguli, AGobbi, AHawkins, JJohnson, ARKiefer, JRLa, HLockey, PNorman, MOuyang, WQin, AWakes, NWaszkowycz, BWong, H A reversed sulfonamide series of selective RORc inverse agonists. Bioorg Med Chem Lett24:5769-76 (2014) 
 
Nuclear receptor ROR-gamma
Name:Nuclear receptor ROR-gamma
Type:Enzyme Catalytic Domain
Mol. Mass.:58218.40
Organism:Homo sapiens (Human)
Description:P51449
Residue:518
BDBM50035914
NameBDBM50035914
Synonyms:CHEMBL3361057
TypeSmall organic molecule
Emp. Form.C22H29FN2O5S2
Mol. Mass.484.604
SMILESCC(C)CN(c1cccc(F)c1)S(=O)(=O)c1ccc(OC2CCN(CC2)S(C)(=O)=O)cc1