Reaction Details
TargetInduced myeloid leukemia cell differentiation protein Mcl-1
LigandBDBM50036201
Substrate/Competitorn/a
Meas. Tech.ChEMBL_1437221 (CHEMBL3382995)
Ki 14000±n/a nM
Citation Sameshima, TMiyahisa, IHomma, MAikawa, KHixon, MSMatsui, J A simple and widely applicable hit validation strategy for protein-protein interaction inhibitors based on a quantitative ligand displacement assay. Bioorg Med Chem Lett24:5836-9 (2014) 
 
Induced myeloid leukemia cell differentiation protein Mcl-1
Name:Induced myeloid leukemia cell differentiation protein Mcl-1
Type:Membrane; Single-pass membrane protein
Mol. Mass.:37332.87
Organism:Homo sapiens (Human)
Description:Q07820
Residue:350
BDBM50036201
NameBDBM50036201
Synonyms:CHEMBL3358688
TypeSmall organic molecule
Emp. Form.C22H23ClO3S
Mol. Mass.402.934
SMILESOC(=O)C(CC(=O)c1ccc(cc1)C1CCCCC1)Sc1ccc(Cl)cc1