Reaction Details
TargetHistone deacetylase 3
LigandBDBM50440912
Substrate/Competitorn/a
Meas. Tech.ChEMBL_1431997 (CHEMBL3388102)
IC50 4500±n/a nM
Citation Blackburn, CBarrett, CBrunson, MChin, JEngland, DGarcia, KGigstad, KGould, AGutierrez, JHoar, KRowland, RSTsu, CRingeling, JWager, KXu, H Histone deacetylase inhibitors derived from 1,2,3,4-tetrahydropyrrolo[1,2-a]pyrazine and related heterocycles selective for the HDAC6 isoform. Bioorg Med Chem Lett24:5450-4 (2015) 
 
Histone deacetylase 3
Name:Histone deacetylase 3
Type:Enzyme
Mol. Mass.:48829.55
Organism:Homo sapiens (Human)
Description:O15379
Residue:428
BDBM50440912
NameBDBM50440912
Synonyms:CHEMBL2431862
TypeSmall organic molecule
Emp. Form.C14H15N3O3
Mol. Mass.273.2872
SMILESCn1cccc1C(=O)NCc1ccc(cc1)C(=O)NO