Reaction Details
TargetHistone deacetylase 5
LigandBDBM22449
Substrate/Competitorn/a
Meas. Tech.ChEMBL_1431999 (CHEMBL3388104)
IC50 3350±n/a nM
Citation Blackburn, CBarrett, CBrunson, MChin, JEngland, DGarcia, KGigstad, KGould, AGutierrez, JHoar, KRowland, RSTsu, CRingeling, JWager, KXu, H Histone deacetylase inhibitors derived from 1,2,3,4-tetrahydropyrrolo[1,2-a]pyrazine and related heterocycles selective for the HDAC6 isoform. Bioorg Med Chem Lett24:5450-4 (2015) 
 
Histone deacetylase 5
Name:Histone deacetylase 5
Type:Enzyme
Mol. Mass.:121968.61
Organism:Homo sapiens (Human)
Description:Q9UQL6
Residue:1122
BDBM22449
NameBDBM22449
Synonyms:CHEMBL356769 Tubacin | US9249087, Tubastatin A
TypeSmall organic molecule
Emp. Form.C41H43N3O7S
Mol. Mass.721.861
SMILESOCc1ccc(cc1)[C@@H]1C[C@H](CSc2nc(c(o2)-c2ccccc2)-c2ccccc2)O[C@@H](O1)c1ccc(NC(=O)CCCCCCC(=O)NO)cc1