Reaction Details
TargetHistone deacetylase 8
LigandBDBM50036285
Substrate/Competitorn/a
Meas. Tech.ChEMBL_1432001 (CHEMBL3388106)
IC50 3300±n/a nM
Citation Blackburn, CBarrett, CBrunson, MChin, JEngland, DGarcia, KGigstad, KGould, AGutierrez, JHoar, KRowland, RSTsu, CRingeling, JWager, KXu, H Histone deacetylase inhibitors derived from 1,2,3,4-tetrahydropyrrolo[1,2-a]pyrazine and related heterocycles selective for the HDAC6 isoform. Bioorg Med Chem Lett24:5450-4 (2015) 
 
Histone deacetylase 8
Name:Histone deacetylase 8
Type:Enzyme
Mol. Mass.:41749.60
Organism:Homo sapiens (Human)
Description:Q9BY41
Residue:377
BDBM50036285
NameBDBM50036285
Synonyms:CHEMBL3353053
TypeSmall organic molecule
Emp. Form.C14H16N4O3
Mol. Mass.288.3018
SMILESCn1cccc1C(=O)N1CCn2cc(cc2C1)C(=O)NO