Reaction Details
TargetHistone deacetylase 8
LigandBDBM50380399
Substrate/Competitorn/a
Meas. Tech.ChEMBL_1432001 (CHEMBL3388106)
IC50 854±n/a nM
Citation Blackburn, CBarrett, CBrunson, MChin, JEngland, DGarcia, KGigstad, KGould, AGutierrez, JHoar, KRowland, RSTsu, CRingeling, JWager, KXu, H Histone deacetylase inhibitors derived from 1,2,3,4-tetrahydropyrrolo[1,2-a]pyrazine and related heterocycles selective for the HDAC6 isoform. Bioorg Med Chem Lett24:5450-4 (2015) 
 
Histone deacetylase 8
Name:Histone deacetylase 8
Type:Enzyme
Mol. Mass.:41749.60
Organism:Homo sapiens (Human)
Description:Q9BY41
Residue:377
BDBM50380399
NameBDBM50380399
Synonyms:CHEMBL2018302 US10227295, Compound Tubastatin A US11207431, Example D US9249087, Tubacin US9956192, Compound Tubastatin-A
TypeSmall organic molecule
Emp. Form.C20H21N3O2
Mol. Mass.335.3996
SMILESCN1CCc2c(C1)c1ccccc1n2Cc1ccc(cc1)C(=O)NO