Reaction Details
TargetPolyamine deacetylase HDAC10
LigandBDBM50440907
Substrate/Competitorn/a
Meas. Tech.ChEMBL_1432002 (CHEMBL3388107)
IC50>50000±n/a nM
Citation Blackburn, CBarrett, CBrunson, MChin, JEngland, DGarcia, KGigstad, KGould, AGutierrez, JHoar, KRowland, RSTsu, CRingeling, JWager, KXu, H Histone deacetylase inhibitors derived from 1,2,3,4-tetrahydropyrrolo[1,2-a]pyrazine and related heterocycles selective for the HDAC6 isoform. Bioorg Med Chem Lett24:5450-4 (2015) 
 
Polyamine deacetylase HDAC10
Name:Polyamine deacetylase HDAC10
Type:Chromatin regulator; hydrolase; repressor
Mol. Mass.:71431.89
Organism:Homo sapiens (Human)
Description:Q969S8
Residue:669
BDBM50440907
NameBDBM50440907
Synonyms:CHEMBL2431901
TypeSmall organic molecule
Emp. Form.C16H17N3O3
Mol. Mass.299.3245
SMILESCn1cccc1C(=O)N1CCc2cc(ccc2C1)C(=O)NO