Reaction Details
TargetHistone deacetylase 6
LigandBDBM50036290
Substrate/Competitorn/a
Meas. Tech.ChEMBL_1431991 (CHEMBL3388096)
IC50 130±n/a nM
Citation Blackburn, CBarrett, CBrunson, MChin, JEngland, DGarcia, KGigstad, KGould, AGutierrez, JHoar, KRowland, RSTsu, CRingeling, JWager, KXu, H Histone deacetylase inhibitors derived from 1,2,3,4-tetrahydropyrrolo[1,2-a]pyrazine and related heterocycles selective for the HDAC6 isoform. Bioorg Med Chem Lett24:5450-4 (2015) 
 
Histone deacetylase 6
Name:Histone deacetylase 6
Type:Chromatin regulator; hydrolase; repressor
Mol. Mass.:131381.51
Organism:Homo sapiens (Human)
Description:Q9UBN7
Residue:1215
BDBM50036290
NameBDBM50036290
Synonyms:CHEMBL3353066
TypeSmall organic molecule
Emp. Form.C13H15N5O3
Mol. Mass.289.2899
SMILESCn1cccc1C(=O)N1CCn2cc(nc2C1)C(=O)NO