Reaction Details
TargetEquilibrative nucleoside transporter 1
LigandBDBM50036309
Substrate/Competitorn/a
Meas. Tech.ChEMBL_1432010 (CHEMBL3388115)
IC50 3.2±n/a nM
Citation Playa, HLewis, TATing, ASuh, BCMuņoz, BMatuza, RPasser, BJSchreiber, SLBuolamwini, JK Dilazep analogues for the study of equilibrative nucleoside transporters 1 and 2 (ENT1 and ENT2). Bioorg Med Chem Lett24:5801-4 (2014) 
 
Equilibrative nucleoside transporter 1
Name:Equilibrative nucleoside transporter 1
Type:Multi-pass membrane protein
Mol. Mass.:50225.92
Organism:Homo sapiens (Human)
Description:n/a
Residue:456
BDBM50036309
NameBDBM50036309
Synonyms:CHEMBL3353072
TypeSmall organic molecule
Emp. Form.C34H50N2O10
Mol. Mass.646.7682
SMILESCOc1cc(cc(OC)c1OC)C(=O)OCCCCN1CC(C)N(CCCCOC(=O)c2cc(OC)c(OC)c(OC)c2)CC1C