Reaction Details
TargetTransient receptor potential cation channel subfamily M member 8
LigandBDBM50036541
Substrate/Competitorn/a
Meas. Tech.ChEMBL_1432887 (CHEMBL3383300)
IC50 14±n/a nM
Citation Ohmi, MShishido, YInoue, TAndo, KFujiuchi, AYamada, AWatanabe, SKawamura, K Identification of a novel 2-pyridyl-benzensulfonamide derivative, RQ-00203078, as a selective and orally active TRPM8 antagonist. Bioorg Med Chem Lett24:5364-8 (2014) 
 
Transient receptor potential cation channel subfamily M member 8
Name:Transient receptor potential cation channel subfamily M member 8
Type:Enzyme
Mol. Mass.:127693.26
Organism:Homo sapiens (Human)
Description:Q7Z2W7
Residue:1104
BDBM50036541
NameBDBM50036541
Synonyms:CHEMBL3353599
TypeSmall organic molecule
Emp. Form.C21H12ClF7N2O4S
Mol. Mass.556.838
SMILESOC(=O)c1ccc(cc1)S(=O)(=O)N(Cc1ccc(F)c(c1)C(F)(F)F)c1ncc(cc1Cl)C(F)(F)F